Target
Tripeptidyl-peptidase 2
Ligand
BDBM50085126
Substrate
Meas. Tech.
ChEMBL_211948 (CHEMBL816538)
Ki
114000±n/a nM
Citation
 Ganellin, CRBishop, PBBambal, RBChan, SMLaw, JKMarabout, BLuthra, PMMoore, ANPeschard, OBourgeat, PRose, CVargas, FSchwartz, JC Inhibitors of tripeptidyl peptidase II. 2. Generation of the first novel lead inhibitor of cholecystokinin-8-inactivating peptidase: a strategy for the design of peptidase inhibitors. J Med Chem 43:664-74 (2000)  
Target
Name:
Tripeptidyl-peptidase 2
Synonyms:
TPP2_RAT Tripeptidyl aminopeptidase
Type:
PROTEIN
Mol. Mass.:
138287.08
Organism:
Rattus norvegicus
Description:
ChEMBL_211948
Residue:
1249
  
Inhibitor
Name:
BDBM50085126
Synonyms:
2-({1-[2-(2-Amino-propionylamino)-propionyl]-pyrrolidine-2-carbonyl}-amino)-propionic acid | CHEMBL162696
Type:
Small organic molecule
Emp. Form.:
C14H24N4O5
Mol. Mass.:
328.3642
SMILES:
CC(N)C(=O)NC(C)C(=O)N1CCCC1C(=O)NC(C)C(O)=O
: