Target
Sodium/glucose cotransporter 1
Ligand
BDBM50422354
Substrate
Meas. Tech.
ChEMBL_202730 (CHEMBL809058)
Ki
116000±n/a nM
Citation
 Wielert-Badt, SLin, JTLorenz, MFritz, SKinne, RK Probing the conformation of the sugar transport inhibitor phlorizin by 2D-NMR, molecular dynamics studies, and pharmacophore analysis. J Med Chem 43:1692-8 (2000)  
Target
Name:
Sodium/glucose cotransporter 1
Synonyms:
High affinity sodium-glucose cotransporter Na(+)/glucose cotransporter 1 SGLT1 Sodium-dependent glucose cotransporter 1 (SGLT1) Sodium/glucose cotransporter 1 (SGLT1) | Solute carrier family 5 member 1
Type:
Protein
Mol. Mass.:
73503.78
Organism:
Homo sapiens (Human)
Description:
P13866
Residue:
664
  
Inhibitor
Name:
BDBM50422354
Synonyms:
CHEMBL2303993
Type:
Small organic molecule
Emp. Form.:
C25H29NO13
Mol. Mass.:
551.4967
SMILES:
OC[C@@H]1O[C@@H](Oc2cc(O)cc(O)c2C(=O)CCc2ccc(O)c(NC(=O)CCC(O)=O)c2)[C@@H](O)[C@@H](O)[C@@H]1O
: