Target
Peptidyl-prolyl cis-trans isomerase FKBP4
Ligand
BDBM50022815
Substrate
Meas. Tech.
ChEMBL_220732 (CHEMBL843423)
IC50
16±n/a nM
Citation
 Li, QMoutiez, MCharbonnier, JBVaudry, KMénez, AQuéméneur, EDugave, C Design of a Gag pentapeptide analogue that binds human cyclophilin A more efficiently than the entire capsid protein: new insights for the development of novel anti-HIV-1 drugs. J Med Chem 43:1770-9 (2000)  
Target
Name:
Peptidyl-prolyl cis-trans isomerase FKBP4
Synonyms:
FK506 binding protein 4 FKBP4_HUMAN | FKBP52
Type:
PROTEIN
Mol. Mass.:
51793.87
Organism:
Homo sapiens (Human)
Description:
ChEMBL_154482
Residue:
459
  
Inhibitor
Name:
BDBM50022815
Synonyms:
(3S,6S,9S,12R,15S,18S,21S,24S,30S,33S)-30-ethyl-33-[(1R,2R,4E)-1-hydroxy-2-methylhex-4-en-1-yl]-1,4,7,10,12,15,19,25,28-nonamethyl-6,9,18,24-tetrakis(2-methylpropyl)-3,21-bis(propan-2-yl)-1,4,7,10,13,16,19,22,25,28,31-undecaazacyclotritriacontan-2,5,8,11,14,17,20,23,26,29,32-undecone 30-Ethyl-33-(1-hydroxy-2-methyl-hex-4-enyl)-6,9,18,24-tetraisobutyl-3,21-diisopropyl-1,4,7,10,12,15,19,25,28-nonamethyl-1,4,7,10,13,16,19,22,25,28,31undecaaza-cyclotritriacontan-2,5,8,11,14,17,20,23,26,29,32-undecaone Cyclosporin A Cyclosproine A US9138393, Cyclosporin A
Type:
Small organic molecule
Emp. Form.:
C62H111N11O12
Mol. Mass.:
1202.6112
SMILES:
CC[C@@H]1NC(=O)[C@H]([C@H](O)[C@H](C)C\C=C\C)N(C)C(=O)[C@H](C(C)C)N(C)C(=O)[C@H](CC(C)C)N(C)C(=O)[C@H](CC(C)C)N(C)C(=O)[C@@H](C)NC(=O)[C@H](C)NC(=O)[C@H](CC(C)C)N(C)C(=O)[C@@H](NC(=O)[C@H](CC(C)C)N(C)C(=O)CN(C)C1=O)C(C)C
: