Target
Protein kinase C delta type
Ligand
BDBM50057512
Substrate
Meas. Tech.
ChEMBL_153137 (CHEMBL759076)
Ki
210±n/a nM
Citation
 Pak, YEnyedy, IJVarady, JKung, JWLorenzo, PSBlumberg, PMWang, S Structural basis of binding of high-affinity ligands to protein kinase C: prediction of the binding modes through a new molecular dynamics method and evaluation by site-directed mutagenesis. J Med Chem 44:1690-701 (2001)  
Target
Name:
Protein kinase C delta type
Synonyms:
KPCD_MOUSE Prkcd Protein kinase C delta type | nPKC-delta
Type:
PROTEIN
Mol. Mass.:
77554.99
Organism:
Mus musculus
Description:
ChEMBL_1351519
Residue:
674
  
Inhibitor
Name:
BDBM50057512
Synonyms:
(1aR,1bS,4aR,7aS,7bS,8R,9R,9aS)-4a,7b-dihydroxy-3-(hydroxymethyl)-1,1,6,8-tetramethyl-5-oxo-1,1a,1b,4,4a,5,7a,7b,8,9-decahydro-9aH-cyclopropa[3,4]benzo[1,2-e]azulene-9,9a-diyl dibutanoate PDBu phorbol 12,13-dibutyrate
Type:
Small organic molecule
Emp. Form.:
C28H40O8
Mol. Mass.:
504.6124
SMILES:
CCCC(=O)O[C@@H]1[C@@H](C)[C@]2(O)[C@@H]3C=C(C)C(=O)[C@@]3(O)CC(CO)=C[C@H]2[C@@H]2C(C)(C)[C@]12OC(=O)CCC
: