Target
Glyceraldehyde-3-phosphate dehydrogenase
Ligand
BDBM50100468
Substrate
Meas. Tech.
ChEMBL_72906 (CHEMBL684720)
IC50
>50000±n/a nM
Citation
 Bressi, JCVerlinde, CLAronov, AMShaw, MLShin, SSNguyen, LNSuresh, SBuckner, FSVan Voorhis, WCKuntz, IDHol, WGGelb, MH Adenosine analogues as selective inhibitors of glyceraldehyde-3-phosphate dehydrogenase of Trypanosomatidae via structure-based drug design. J Med Chem 44:2080-93 (2001)  
Target
Name:
Glyceraldehyde-3-phosphate dehydrogenase
Synonyms:
G3P_HUMAN GAPDH | Glyceraldehyde-3-phosphate dehydrogenase liver
Type:
PROTEIN
Mol. Mass.:
36060.86
Organism:
Homo sapiens (Human)
Description:
ChEMBL_1511315
Residue:
335
  
Inhibitor
Name:
BDBM50100468
Synonyms:
CHEMBL291418 | N-(4-Hydroxy-5-hydroxymethyl-2-{6-[(naphthalen-2-ylmethyl)-amino]-purin-9-ylmethyl}-tetrahydro-furan-3-yl)-3-methoxy-benzamide
Type:
Small organic molecule
Emp. Form.:
C30H30N6O5
Mol. Mass.:
554.5964
SMILES:
COc1cccc(c1)C(=O)N[C@@H]1C(Cn2cnc3c(NCc4ccc5ccccc5c4)ncnc23)OC(CO)[C@@H]1O
: