Target
Somatostatin receptor type 3
Ligand
BDBM50103415
Substrate
Meas. Tech.
ChEMBL_200827 (CHEMBL807040)
Ki
13±n/a nM
Citation
 Poitout, LRoubert, PContour-Galcéra, MOMoinet, CLannoy, JPommier, JPlas, PBigg, DThurieau, C Identification of potent non-peptide somatostatin antagonists with sst(3) selectivity. J Med Chem 44:2990-3000 (2001)  
Target
Name:
Somatostatin receptor type 3
Synonyms:
SOMATOSTATIN SST3 SS3-R SSR-28 SSTR3 | Somatostatin receptor type 3 (SSTR3)
Type:
Protein
Mol. Mass.:
45855.97
Organism:
Homo sapiens (Human)
Description:
P32745
Residue:
418
  
Inhibitor
Name:
BDBM50103415
Synonyms:
3-(4-phenyl-1H-2-imidazolyl)-(3S)-spiro[2,3,4,9-tetrahydro-1H-b-carboline-1,2'-(2',3'-dihydro-1'H-indene)] | CHEMBL100061
Type:
Small organic molecule
Emp. Form.:
C28H24N4
Mol. Mass.:
416.517
SMILES:
C1c2ccccc2CC11NC(Cc2c1[nH]c1ccccc21)c1nc(c[nH]1)-c1ccccc1
: