Target
Somatostatin receptor type 4
Ligand
BDBM50068039
Substrate
Meas. Tech.
ChEMBL_200845 (CHEMBL807055)
Ki
6±n/a nM
Citation
 Poitout, LRoubert, PContour-Galcéra, MOMoinet, CLannoy, JPommier, JPlas, PBigg, DThurieau, C Identification of potent non-peptide somatostatin antagonists with sst(3) selectivity. J Med Chem 44:2990-3000 (2001)  
Target
Name:
Somatostatin receptor type 4
Synonyms:
SOMATOSTATIN SST4 SS4-R SSR4_HUMAN SSTR4 | Somatostatin receptor type 4 (SSTR4)
Type:
Enzyme
Mol. Mass.:
42015.38
Organism:
Homo sapiens (Human)
Description:
P31391
Residue:
388
  
Inhibitor
Name:
BDBM50068039
Synonyms:
1-{3-[(5-Bromo-pyridin-2-yl)-(3,4-dichloro-benzyl)-amino]-propyl}-3-[3-(1H-imidazol-4-yl)-propyl]-thiourea | CHEMBL103769
Type:
Small organic molecule
Emp. Form.:
C22H25BrCl2N6S
Mol. Mass.:
556.349
SMILES:
Clc1ccc(CN(CCCNC(=S)NCCCc2cnc[nH]2)c2ccc(Br)cn2)cc1Cl
: