Target
Somatostatin receptor type 3
Ligand
BDBM50103424
Substrate
Meas. Tech.
ChEMBL_200827 (CHEMBL807040)
Ki
60±n/a nM
Citation
 Poitout, LRoubert, PContour-Galcéra, MOMoinet, CLannoy, JPommier, JPlas, PBigg, DThurieau, C Identification of potent non-peptide somatostatin antagonists with sst(3) selectivity. J Med Chem 44:2990-3000 (2001)  
Target
Name:
Somatostatin receptor type 3
Synonyms:
SOMATOSTATIN SST3 SS3-R SSR-28 SSTR3 | Somatostatin receptor type 3 (SSTR3)
Type:
Protein
Mol. Mass.:
45855.97
Organism:
Homo sapiens (Human)
Description:
P32745
Residue:
418
  
Inhibitor
Name:
BDBM50103424
Synonyms:
1-(4-Methoxy-phenyl)-3-(4-phenyl-1H-imidazol-2-yl)-2,3,4,9-tetrahydro-1H-beta-carboline | CHEMBL320211
Type:
Small organic molecule
Emp. Form.:
C27H24N4O
Mol. Mass.:
420.5057
SMILES:
COc1ccc(cc1)C1NC(Cc2c1[nH]c1ccccc21)c1nc(c[nH]1)-c1ccccc1
: