Target
Somatostatin receptor type 3
Ligand
BDBM50369890
Substrate
Meas. Tech.
ChEMBL_200827 (CHEMBL807040)
Ki
3.4±n/a nM
Citation
 Poitout, LRoubert, PContour-Galcéra, MOMoinet, CLannoy, JPommier, JPlas, PBigg, DThurieau, C Identification of potent non-peptide somatostatin antagonists with sst(3) selectivity. J Med Chem 44:2990-3000 (2001)  
Target
Name:
Somatostatin receptor type 3
Synonyms:
SOMATOSTATIN SST3 SS3-R SSR-28 SSTR3 | Somatostatin receptor type 3 (SSTR3)
Type:
Protein
Mol. Mass.:
45855.97
Organism:
Homo sapiens (Human)
Description:
P32745
Residue:
418
  
Inhibitor
Name:
BDBM50369890
Synonyms:
CHEMBL1237140 | CHEMBL1788167
Type:
Small organic molecule
Emp. Form.:
C28H34N4
Mol. Mass.:
426.5964
SMILES:
CCCCC1(CCCC)N[C@@H](Cc2c1[nH]c1ccccc21)c1nc(c[nH]1)-c1ccccc1
: