Target
Somatostatin receptor type 3
Ligand
BDBM50103429
Substrate
Meas. Tech.
ChEMBL_200827 (CHEMBL807040)
Ki
33±n/a nM
Citation
 Poitout, LRoubert, PContour-Galcéra, MOMoinet, CLannoy, JPommier, JPlas, PBigg, DThurieau, C Identification of potent non-peptide somatostatin antagonists with sst(3) selectivity. J Med Chem 44:2990-3000 (2001)  
Target
Name:
Somatostatin receptor type 3
Synonyms:
SOMATOSTATIN SST3 SS3-R SSR-28 SSTR3 | Somatostatin receptor type 3 (SSTR3)
Type:
Protein
Mol. Mass.:
45855.97
Organism:
Homo sapiens (Human)
Description:
P32745
Residue:
418
  
Inhibitor
Name:
BDBM50103429
Synonyms:
CHEMBL321066 | Dimethyl-{4-[3-(4-phenyl-1H-imidazol-2-yl)-2,3,4,9-tetrahydro-1H-beta-carbolin-1-yl]-phenyl}-amine
Type:
Small organic molecule
Emp. Form.:
C28H27N5
Mol. Mass.:
433.5475
SMILES:
CN(C)c1ccc(cc1)C1NC(Cc2c1[nH]c1ccccc21)c1nc(c[nH]1)-c1ccccc1
: