Target
Adenosine transporter 1
Ligand
BDBM50105128
Substrate
Meas. Tech.
ChEMBL_149711 (CHEMBL755808)
Ki
25000±n/a nM
Citation
 Klenke, BStewart, MBarrett, MPBrun, RGilbert, IH Synthesis and biological evaluation of s-triazine substituted polyamines as potential new anti-trypanosomal drugs. J Med Chem 44:3440-52 (2001)  
Target
Name:
Adenosine transporter 1
Synonyms:
Type:
PROTEIN
Mol. Mass.:
51044.02
Organism:
Trypanosoma brucei
Description:
ChEMBL_31141
Residue:
463
  
Inhibitor
Name:
BDBM50105128
Synonyms:
CHEMBL538778 | N-{3-[12-(3-Amino-propylamino)-dodecylamino]-propyl}-N',N''-dimethyl-[1,3,5]triazine-2,4,6-triaminepentahydrochloride
Type:
Small organic molecule
Emp. Form.:
C23H49N9
Mol. Mass.:
451.6955
SMILES:
CNc1nc(NC)nc(NCCCNCCCCCCCCCCCCNCCCN)n1
: