Target
Adenosine transporter 1
Ligand
BDBM50105136
Substrate
Meas. Tech.
ChEMBL_149711 (CHEMBL755808)
Ki
55000±n/a nM
Citation
 Klenke, BStewart, MBarrett, MPBrun, RGilbert, IH Synthesis and biological evaluation of s-triazine substituted polyamines as potential new anti-trypanosomal drugs. J Med Chem 44:3440-52 (2001)  
Target
Name:
Adenosine transporter 1
Synonyms:
Type:
PROTEIN
Mol. Mass.:
51044.02
Organism:
Trypanosoma brucei
Description:
ChEMBL_31141
Residue:
463
  
Inhibitor
Name:
BDBM50105136
Synonyms:
CHEMBL552613 | N2-(3-[2-(3-[(4,6-Diamino-1,3,5-triazin-2-yl)amino]propylamino)cyclohexyl]aminopropyl)-1,3,5-triazine-2,4,6-triamine Tetrahydrochloride
Type:
Small organic molecule
Emp. Form.:
C18H34N14
Mol. Mass.:
446.5564
SMILES:
Nc1nc(N)nc(NCCCNC2CCCCC2NCCCNc2nc(N)nc(N)n2)n1
: