Target
Adenosine transporter 1
Ligand
BDBM50105120
Substrate
Meas. Tech.
ChEMBL_149711 (CHEMBL755808)
Ki
410±n/a nM
Citation
 Klenke, BStewart, MBarrett, MPBrun, RGilbert, IH Synthesis and biological evaluation of s-triazine substituted polyamines as potential new anti-trypanosomal drugs. J Med Chem 44:3440-52 (2001)  
Target
Name:
Adenosine transporter 1
Synonyms:
Type:
PROTEIN
Mol. Mass.:
51044.02
Organism:
Trypanosoma brucei
Description:
ChEMBL_31141
Residue:
463
  
Inhibitor
Name:
BDBM50105120
Synonyms:
CHEMBL542932 | N-{3-[12-(3-Amino-propylamino)-dodecylamino]-propyl}-N'-methyl-[1,3,5]triazine-2,4,6-triaminetetrahydrochloride
Type:
Small organic molecule
Emp. Form.:
C22H47N9
Mol. Mass.:
437.6689
SMILES:
CNc1nc(N)nc(NCCCNCCCCCCCCCCCCNCCCN)n1
: