Target
D(2) dopamine receptor
Ligand
BDBM50106482
Substrate
Meas. Tech.
ChEMBL_62252 (CHEMBL675479)
Ki
38000±n/a nM
Citation
 Xu, YCJohnson, KWPhebus, LACohen, MNelson, DLSchenck, KWalker, CDFritz, JEKaldor, SWLeTourneau, MEMurff, REZgombick, JMCalligaro, DOAudia, JESchaus, JM N-[3-(2-Dimethylaminoethyl)-2-methyl-1H- indol-5-yl]-4-fluorobenzamide: a potent, selective, and orally active 5-HT(1F) receptor agonist potentially useful for migraine therapy. J Med Chem 44:4031-4 (2001)  
Target
Name:
D(2) dopamine receptor
Synonyms:
DOPAMINE D2 DOPAMINE D2 Short Dopamine D2 receptor Drd2
Type:
G Protein-Coupled Receptor (GPCR)
Mol. Mass.:
50931.60
Organism:
Rattus norvegicus (rat)
Description:
P61169
Residue:
444
  
Inhibitor
Name:
BDBM50106482
Synonyms:
CHEMBL339980 | N-[3-(2-Dimethylamino-ethyl)-2-methyl-1H-indol-4-yl]-4-fluoro-benzamide
Type:
Small organic molecule
Emp. Form.:
C20H22FN3O
Mol. Mass.:
339.4066
SMILES:
CN(C)CCc1c(C)[nH]c2cccc(NC(=O)c3ccc(F)cc3)c12
: