Target
5-hydroxytryptamine receptor 2B
Ligand
BDBM50106482
Substrate
Meas. Tech.
ChEMBL_2866 (CHEMBL617408)
Ki
676±n/a nM
Citation
 Xu, YCJohnson, KWPhebus, LACohen, MNelson, DLSchenck, KWalker, CDFritz, JEKaldor, SWLeTourneau, MEMurff, REZgombick, JMCalligaro, DOAudia, JESchaus, JM N-[3-(2-Dimethylaminoethyl)-2-methyl-1H- indol-5-yl]-4-fluorobenzamide: a potent, selective, and orally active 5-HT(1F) receptor agonist potentially useful for migraine therapy. J Med Chem 44:4031-4 (2001)  
Target
Name:
5-hydroxytryptamine receptor 2B
Synonyms:
5-HT-2B 5-hydroxytryptamine (serotonin) receptor 2B [Homo sapiens] 5-hydroxytryptamine receptor 2C (5HT2C) HTR2B Serotonin 2b (5-HT2b) receptor | Serotonin Receptor 2B
Type:
G Protein-Coupled Receptor (GPCR)
Mol. Mass.:
54312.47
Organism:
Homo sapiens (Human)
Description:
Receptor binding assays were performed using human clone stably expressed in CHO cells.
Residue:
481
  
Inhibitor
Name:
BDBM50106482
Synonyms:
CHEMBL339980 | N-[3-(2-Dimethylamino-ethyl)-2-methyl-1H-indol-4-yl]-4-fluoro-benzamide
Type:
Small organic molecule
Emp. Form.:
C20H22FN3O
Mol. Mass.:
339.4066
SMILES:
CN(C)CCc1c(C)[nH]c2cccc(NC(=O)c3ccc(F)cc3)c12
: