Target
Alpha-1D adrenergic receptor
Ligand
BDBM50370023
Substrate
Meas. Tech.
ChEMBL_33678 (CHEMBL646819)
Ki
0.35±n/a nM
Citation
 Boyd, REPress, JBRasmussen, CRRaffa, RBCodd, EEConnelly, CDLi, QSMartinez, RPLewis, MAAlmond, HRReitz, AB Alpha(2) adrenoceptor agonists as potential analgesic agents. 3. Imidazolylmethylthiophenes. J Med Chem 44:863-72 (2001)  
Target
Name:
Alpha-1D adrenergic receptor
Synonyms:
ADA1D_HUMAN ADRA1D Adrenergic receptor alpha Alpha 1D-adrenoreceptor Alpha-1D adrenoceptor adrenergic Alpha1D
Type:
Enzyme Catalytic Domain
Mol. Mass.:
60485.82
Organism:
Homo sapiens (Human)
Description:
adrenergic Alpha1D ADRA1D HUMAN::P25100
Residue:
572
  
Inhibitor
Name:
BDBM50370023
Synonyms:
CHEMBL1203850
Type:
Small organic molecule
Emp. Form.:
C8H7BrN2S
Mol. Mass.:
243.124
SMILES:
Brc1ccsc1Cc1cnc[nH]1
: