Target
Alpha-1D adrenergic receptor
Ligand
BDBM50370028
Substrate
Meas. Tech.
ChEMBL_33678 (CHEMBL646819)
Ki
0.440±n/a nM
Citation
 Boyd, REPress, JBRasmussen, CRRaffa, RBCodd, EEConnelly, CDLi, QSMartinez, RPLewis, MAAlmond, HRReitz, AB Alpha(2) adrenoceptor agonists as potential analgesic agents. 3. Imidazolylmethylthiophenes. J Med Chem 44:863-72 (2001)  
Target
Name:
Alpha-1D adrenergic receptor
Synonyms:
ADA1D_HUMAN ADRA1D Adrenergic receptor alpha Alpha 1D-adrenoreceptor Alpha-1D adrenoceptor adrenergic Alpha1D
Type:
Enzyme Catalytic Domain
Mol. Mass.:
60485.82
Organism:
Homo sapiens (Human)
Description:
adrenergic Alpha1D ADRA1D HUMAN::P25100
Residue:
572
  
Inhibitor
Name:
BDBM50370028
Synonyms:
CHEMBL1744294
Type:
Small organic molecule
Emp. Form.:
C9H10N2S
Mol. Mass.:
178.254
SMILES:
Cc1sccc1Cc1cnc[nH]1
: