Target
B2 bradykinin receptor
Ligand
BDBM50409529
Substrate
Meas. Tech.
ChEMBL_40430 (CHEMBL876526)
Ki
1.47±n/a nM
Citation
 Dziadulewicz, EKRitchie, TJHallett, ASnell, CRDavies, JWWrigglesworth, RDunstan, ARBloomfield, GCDrake, GSMcIntyre, PBrown, MCBurgess, GMLee, WDavis, CYaqoob, MPhagoo, SBPhillips, EPerkins, MNCampbell, EADavis, AJRang, HP Nonpeptide bradykinin B2 receptor antagonists: conversion of rodent-selective bradyzide analogues into potent, orally-active human bradykinin B2 receptor antagonists. J Med Chem 45:2160-72 (2002)  
Target
Name:
B2 bradykinin receptor
Synonyms:
B2 BRADYKININ B2R BK-2 receptor BKRB2_HUMAN | Bradykinin B2 receptor
Type:
Enzyme Catalytic Domain
Mol. Mass.:
44467.17
Organism:
Homo sapiens (Human)
Description:
B2 BRADYKININ BDKRB2 HUMAN::P30411
Residue:
391
  
Inhibitor
Name:
BDBM50409529
Synonyms:
CHEMBL2112221
Type:
Small organic molecule
Emp. Form.:
C34H40N8O5S2
Mol. Mass.:
704.862
SMILES:
CN(C)CCN(C)CCNC(=O)c1cccn1S(=O)(=O)c1ccc(N[N-]C(=[SH+])NC2c3ccccc3CCc3ccccc23)c(c1)[N+]([O-])=O
: