Target
Prothrombin
Ligand
BDBM50070629
Substrate
Meas. Tech.
ChEMBL_210588 (CHEMBL817554)
Ki
23000±n/a nM
Citation
 Cozzini, PFornabaio, MMarabotti, AAbraham, DJKellogg, GEMozzarelli, A Simple, intuitive calculations of free energy of binding for protein-ligand complexes. 1. Models without explicit constrained water. J Med Chem 45:2469-83 (2002)  
Target
Name:
Prothrombin
Synonyms:
Activation peptide fragment 1 Coagulation factor II Prothrombin Thrombin Thrombin light chain
Type:
Enzyme
Mol. Mass.:
70502.73
Organism:
Bos taurus (Bovine)
Description:
P00735
Residue:
625
  
Inhibitor
Name:
BDBM50070629
Synonyms:
4-[2-(3-Benzenesulfonylamino-5-methyl-phenoxy)-ethylamino]-pyridinium N-{3-Methyl-5-[2-(pyridin-4-ylamino)-ethoxy]-phenyl}-benzenesulfonamide
Type:
Small organic molecule
Emp. Form.:
C20H21N3O3S
Mol. Mass.:
383.464
SMILES:
Cc1cc(NS(=O)(=O)c2ccccc2)cc(OCCNc2ccncc2)c1
: