Target
Coagulation factor X
Ligand
BDBM50066638
Substrate
Meas. Tech.
ChEMBL_49312 (CHEMBL663411)
Ki
1.8±n/a nM
Citation
 Phillips, GGuilford, WJBuckman, BODavey, DDEagen, KAKoovakkat, SLiang, AMcCarrick, MMohan, RNg, HPPinkerton, MSubramanyam, BHo, ETrinh, LWhitlow, MWu, SXu, WMorrissey, MM Design, synthesis, and activity of a novel series of factor Xa inhibitors: optimization of arylamidine groups. J Med Chem 45:2484-93 (2002)  
Target
Name:
Coagulation factor X
Synonyms:
Activated coagulation factor X (FXa) Coagulation factor X precursor F10 Factor X heavy chain Factor Xa Stuart-Prower factor
Type:
Enzyme
Mol. Mass.:
54726.60
Organism:
Homo sapiens (Human)
Description:
Residue:
488
  
Inhibitor
Name:
BDBM50066638
Synonyms:
3-[6-(5-Carbamimidoyl-2-hydroxy-phenoxy)-3,5-difluoro-4-methyl-pyridin-2-yloxy]-N,N-dimethyl-benzamide | CHEMBL419651
Type:
Small organic molecule
Emp. Form.:
C22H20F2N4O4
Mol. Mass.:
442.4154
SMILES:
CN(C)C(=O)c1cccc(Oc2nc(Oc3cc(ccc3O)C(N)=N)c(F)c(C)c2F)c1
: