Target
Neutrophil elastase
Ligand
BDBM50118030
Substrate
Meas. Tech.
ChEMBL_63814 (CHEMBL676203)
IC50
150±n/a nM
Citation
 Macdonald, SJDowle, MDHarrison, LAClarke, GDInglis, GGJohnson, MRShah, PSmith, RAAmour, AFleetwood, GHumphreys, DCMolloy, CRDixon, MGodward, REWonacott, AJSingh, OMHodgson, STHardy, GW Discovery of further pyrrolidine trans-lactams as inhibitors of human neutrophil elastase (HNE) with potential as development candidates and the crystal structure of HNE complexed with an inhibitor (GW475151). J Med Chem 45:3878-90 (2002)  
Target
Name:
Neutrophil elastase
Synonyms:
Bone marrow serine protease Coagulation factor X ELANE Elastase HLE Leukocyte elastase Medullasin Neutrophil elastase (HNE) PMN elastase Trypsin
Type:
Enzyme
Mol. Mass.:
28532.38
Organism:
Homo sapiens (Human)
Description:
P08246
Residue:
267
  
Inhibitor
Name:
BDBM50118030
Synonyms:
4-(5-Cyclopropylaminomethyl-pyrazine-2-carbonyl)-3-isopropyl-1-methanesulfonyl-hexahydro-pyrrolo[3,2-b]pyrrol-2-one; hydrochloride | CHEMBL543416
Type:
Small organic molecule
Emp. Form.:
C19H27N5O4S
Mol. Mass.:
421.514
SMILES:
CC(C)[C@H]1[C@H]2[C@@H](CCN2C(=O)c2cnc(CNC3CC3)cn2)N(C1=O)S(C)(=O)=O
: