Target
Cathepsin G
Ligand
BDBM50118029
Substrate
Meas. Tech.
ChEMBL_45525 (CHEMBL661863)
IC50
<100000±n/a nM
Citation
 Macdonald, SJDowle, MDHarrison, LAClarke, GDInglis, GGJohnson, MRShah, PSmith, RAAmour, AFleetwood, GHumphreys, DCMolloy, CRDixon, MGodward, REWonacott, AJSingh, OMHodgson, STHardy, GW Discovery of further pyrrolidine trans-lactams as inhibitors of human neutrophil elastase (HNE) with potential as development candidates and the crystal structure of HNE complexed with an inhibitor (GW475151). J Med Chem 45:3878-90 (2002)  
Target
Name:
Cathepsin G
Synonyms:
CATG_HUMAN CTSG
Type:
PROTEIN
Mol. Mass.:
28860.08
Organism:
Homo sapiens (Human)
Description:
ChEMBL_1469016
Residue:
255
  
Inhibitor
Name:
BDBM50118029
Synonyms:
3-Isopropyl-1-methanesulfonyl-4-(4-piperidin-1-yl-but-2-enoyl)-hexahydro-pyrrolo[3,2-b]pyrrol-2-one; hydrochloride | CHEMBL2368616
Type:
Small organic molecule
Emp. Form.:
C19H32ClN3O4S
Mol. Mass.:
433.993
SMILES:
Cl.[H][C@@]12CCN(C(=O)\C=C\CN3CCCCC3)[C@@]1([H])[C@H](C(C)C)C(=O)N2S(C)(=O)=O
: