Target
Chymotrypsinogen A
Ligand
BDBM50118027
Substrate
Meas. Tech.
ChEMBL_49927 (CHEMBL664296)
IC50
31000±n/a nM
Citation
 Macdonald, SJDowle, MDHarrison, LAClarke, GDInglis, GGJohnson, MRShah, PSmith, RAAmour, AFleetwood, GHumphreys, DCMolloy, CRDixon, MGodward, REWonacott, AJSingh, OMHodgson, STHardy, GW Discovery of further pyrrolidine trans-lactams as inhibitors of human neutrophil elastase (HNE) with potential as development candidates and the crystal structure of HNE complexed with an inhibitor (GW475151). J Med Chem 45:3878-90 (2002)  
Target
Name:
Chymotrypsinogen A
Synonyms:
Alpha-chymotrypsin Chymotrypsin A Chymotrypsin A chain B Chymotrypsinogen A | alpha-Chymotrypsin (α-Chymotrypsin)
Type:
Serine protease
Mol. Mass.:
25670.88
Organism:
Bos taurus (bovine)
Description:
Residue:
245
  
Inhibitor
Name:
BDBM50118027
Synonyms:
4-[1-(2,2-Dimethyl-propyl)-azetidine-3-carbonyl]-3-isopropyl-1-methanesulfonyl-hexahydro-pyrrolo[3,2-b]pyrrol-2-one; hydrochloride | CHEMBL554013
Type:
Small organic molecule
Emp. Form.:
C19H33N3O4S
Mol. Mass.:
399.548
SMILES:
CC(C)[C@H]1[C@H]2[C@@H](CCN2C(=O)C2CN(CC(C)(C)C)C2)N(C1=O)S(C)(=O)=O
: