Target
Serine protease 1
Ligand
BDBM50118028
Substrate
Meas. Tech.
ChEMBL_225800 (CHEMBL845148)
IC50
>100000±n/a nM
Citation
 Macdonald, SJDowle, MDHarrison, LAClarke, GDInglis, GGJohnson, MRShah, PSmith, RAAmour, AFleetwood, GHumphreys, DCMolloy, CRDixon, MGodward, REWonacott, AJSingh, OMHodgson, STHardy, GW Discovery of further pyrrolidine trans-lactams as inhibitors of human neutrophil elastase (HNE) with potential as development candidates and the crystal structure of HNE complexed with an inhibitor (GW475151). J Med Chem 45:3878-90 (2002)  
Target
Name:
Serine protease 1
Synonyms:
Alpha-trypsin chain 1 Beta-trypsin PRSS1 TRP1 TRY1_HUMAN Thrombin & trypsin Trypsin I | Trypsin-1
Type:
Enzyme
Mol. Mass.:
26557.80
Organism:
Homo sapiens (Human)
Description:
P07477
Residue:
247
  
Inhibitor
Name:
BDBM50118028
Synonyms:
3-Isopropyl-1-methanesulfonyl-4-(2-pyrrolidin-1-ylmethyl-oxazole-4-carbonyl)-hexahydro-pyrrolo[3,2-b]pyrrol-2-one; hydrochloride | CHEMBL542949
Type:
Small organic molecule
Emp. Form.:
C19H28N4O5S
Mol. Mass.:
424.514
SMILES:
CC(C)[C@H]1[C@H]2[C@@H](CCN2C(=O)c2coc(CN3CCCC3)n2)N(C1=O)S(C)(=O)=O
: