Target
P2X purinoceptor 5
Ligand
BDBM85043
Substrate
Meas. Tech.
ChEMBL_147417 (CHEMBL750991)
EC50
2600±n/a nM
Citation
 Jacobson, KAJarvis, MFWilliams, M Purine and pyrimidine (P2) receptors as drug targets. J Med Chem 45:4057-93 (2002)  
Target
Name:
P2X purinoceptor 5
Synonyms:
ATP receptor P2X5 Purinergic receptor
Type:
PROTEIN
Mol. Mass.:
51486.52
Organism:
Rattus norvegicus
Description:
ChEMBL_147417
Residue:
455
  
Inhibitor
Name:
BDBM85043
Synonyms:
CAS_149017-66-3 NSC_6093163 | PPADS
Type:
Small organic molecule
Emp. Form.:
C14H14N3O12PS2
Mol. Mass.:
511.378
SMILES:
Cc1nc(N=Nc2ccc(cc2S(O)(=O)=O)S(O)(=O)=O)c(COP(O)(O)=O)c(C=O)c1O
: