Target
P2X purinoceptor 1
Ligand
BDBM85043
Substrate
Meas. Tech.
ChEMBL_149731 (CHEMBL759514)
EC50
99±n/a nM
Citation
 Jacobson, KAJarvis, MFWilliams, M Purine and pyrimidine (P2) receptors as drug targets. J Med Chem 45:4057-93 (2002)  
Target
Name:
P2X purinoceptor 1
Synonyms:
ATP receptor P2X1 Purinergic receptor RP-2 protein
Type:
Enzyme Catalytic Domain
Mol. Mass.:
44969.95
Organism:
RAT
Description:
Purinergic, P2X1 0 RAT::P47824
Residue:
399
  
Inhibitor
Name:
BDBM85043
Synonyms:
CAS_149017-66-3 NSC_6093163 | PPADS
Type:
Small organic molecule
Emp. Form.:
C14H14N3O12PS2
Mol. Mass.:
511.378
SMILES:
Cc1nc(N=Nc2ccc(cc2S(O)(=O)=O)S(O)(=O)=O)c(COP(O)(O)=O)c(C=O)c1O
: