Target
P2X purinoceptor 1
Ligand
BDBM50118228
Substrate
Meas. Tech.
ChEMBL_149728 (CHEMBL759511)
IC50
210±n/a nM
Citation
 Jacobson, KAJarvis, MFWilliams, M Purine and pyrimidine (P2) receptors as drug targets. J Med Chem 45:4057-93 (2002)  
Target
Name:
P2X purinoceptor 1
Synonyms:
ATP receptor P2RX1_HUMAN Purinergic receptor | Purinergic, P2X
Type:
Enzyme Catalytic Domain
Mol. Mass.:
44992.65
Organism:
Homo sapiens (Human)
Description:
Purinergic, P2X 0 HUMAN::P51575
Residue:
399
  
Inhibitor
Name:
BDBM50118228
Synonyms:
5,7-Disulfo-4-(3-{3-[3-(4,6,8-trisulfo-naphthalen-1-ylcarbamoyl)-phenyl]-ureido}-benzoylamino)-naphthalene-1-sulfonic acid anion;hexasodium salt Urea derivative
Type:
Small organic molecule
Emp. Form.:
C35H20N4O21S6
Mol. Mass.:
1024.941
SMILES:
[O-]S(=O)(=O)c1cc(c2c(NC(=O)c3cccc(NC(=O)Nc4cccc(c4)C(=O)Nc4ccc(c5cc(cc(c45)S([O-])(=O)=O)S([O-])(=O)=O)S([O-])(=O)=O)c3)ccc(c2c1)S([O-])(=O)=O)S([O-])(=O)=O
: