Target
P2X purinoceptor 6
Ligand
BDBM85043
Substrate
Meas. Tech.
ChEMBL_147419 (CHEMBL750993)
EC50
>100000±n/a nM
Citation
 Jacobson, KAJarvis, MFWilliams, M Purine and pyrimidine (P2) receptors as drug targets. J Med Chem 45:4057-93 (2002)  
Target
Name:
P2X purinoceptor 6
Synonyms:
ATP receptor P2X6 P2rx6 Purinergic receptor | Purinergic receptor P2X-like 1
Type:
PROTEIN
Mol. Mass.:
42451.11
Organism:
Rattus norvegicus
Description:
ChEMBL_147419
Residue:
379
  
Inhibitor
Name:
BDBM85043
Synonyms:
CAS_149017-66-3 NSC_6093163 | PPADS
Type:
Small organic molecule
Emp. Form.:
C14H14N3O12PS2
Mol. Mass.:
511.378
SMILES:
Cc1nc(N=Nc2ccc(cc2S(O)(=O)=O)S(O)(=O)=O)c(COP(O)(O)=O)c(C=O)c1O
: