Target
Beta-secretase 1
Ligand
BDBM50108544
Substrate
Meas. Tech.
ChEMBL_41373 (CHEMBL653496)
IC50
20±n/a nM
Citation
 Tung, JSDavis, DLAnderson, JPWalker, DEMamo, SJewett, NHom, RKSinha, SThorsett, EDJohn, V Design of substrate-based inhibitors of human beta-secretase. J Med Chem 45:259-62 (2002)  
Target
Name:
Beta-secretase 1
Synonyms:
ASP2 Aspartyl protease 2 BACE1 Beta-secretase (BACE) Beta-secretase 1 (BACE 1) Beta-secretase 1 (BACE1) Beta-site amyloid precursor protein cleaving enzyme 1 Memapsin-2 beta-Secretase (BACE-1) | beta-Secretase (BACE1)
Type:
Protein
Mol. Mass.:
55755.10
Organism:
Homo sapiens (Human)
Description:
P56817
Residue:
501
  
Inhibitor
Name:
BDBM50108544
Synonyms:
4-(2-{5-[2-(2-Acetylamino-3-methyl-butyrylamino)-4-methylsulfanyl-butyrylamino]-4-hydroxy-2-isopropyl-7-methyl-octanoylamino}-propionylamino)-4-(1-carboxy-2-phenyl-ethylcarbamoyl)-butyric acid(Ac-Val-Met-Hydroxyethylene-Ala-Glu-Phe-COOH) | CHEMBL90043
Type:
Small organic molecule
Emp. Form.:
C41H66N6O11S
Mol. Mass.:
851.061
SMILES:
CSCC[C@H](NC(=O)[C@@H](NC(C)=O)C(C)C)C(=O)N[C@@H](CC(C)C)C(O)C[C@@H](C(C)C)C(=O)N[C@@H](C)C(=O)N[C@@H](CCC(O)=O)C(=O)N[C@@H](Cc1ccccc1)C(O)=O
: