Target
D(2) dopamine receptor
Ligand
BDBM50119379
Substrate
Meas. Tech.
ChEMBL_61809 (CHEMBL672573)
Ki
65±n/a nM
Citation
 Bettinetti, LSchlotter, KHübner, HGmeiner, P Interactive SAR studies: rational discovery of super-potent and highly selective dopamine D3 receptor antagonists and partial agonists. J Med Chem 45:4594-7 (2002)  
Target
Name:
D(2) dopamine receptor
Synonyms:
D(2) dopamine receptor DOPAMINE D2 Long DRD2 Dopamine D2 receptor Dopamine D2 receptor (D2R) Dopamine2-like | d2
Type:
Cell-surface receptors
Mol. Mass.:
50647.10
Organism:
Homo sapiens (Human)
Description:
P14416
Residue:
443
  
Inhibitor
Name:
BDBM50119379
Synonyms:
CHEMBL423735 Pyrazolo[1,5-a]pyridine-3-carboxylic acid {4-[4-(2-methoxy-phenyl)-piperazin-1-yl]-butyl}-amide
Type:
Small organic molecule
Emp. Form.:
C23H29N5O2
Mol. Mass.:
407.5087
SMILES:
COc1ccccc1N1CCN(CCCCNC(=O)c2cnn3ccccc23)CC1
: