Target
D(3) dopamine receptor
Ligand
BDBM50119384
Substrate
Meas. Tech.
ChEMBL_62129 (CHEMBL674519)
Ki
1.5±n/a nM
Citation
 Bettinetti, LSchlotter, KHübner, HGmeiner, P Interactive SAR studies: rational discovery of super-potent and highly selective dopamine D3 receptor antagonists and partial agonists. J Med Chem 45:4594-7 (2002)  
Target
Name:
D(3) dopamine receptor
Synonyms:
DOPAMINE D3 DRD3_HUMAN Dopamine D3 receptor (D3) Dopamine receptor Dopamine receptor D3
Type:
Mol. Mass.:
44243.43
Organism:
Homo sapiens (Human)
Description:
Residue:
400
  
Inhibitor
Name:
BDBM50119384
Synonyms:
Benzofuran-2-carboxylic acid {4-[4-(2,3-dichloro-phenyl)-piperazin-1-yl]-butyl}-amide N-(4-(4-(2,3-dichlorophenyl)piperazin-1-yl)butyl)benzofuran-2-carboxamide
Type:
Small organic molecule
Emp. Form.:
C23H25Cl2N3O2
Mol. Mass.:
446.37
SMILES:
Clc1cccc(N2CCN(CCCCNC(=O)c3cc4ccccc4o3)CC2)c1Cl
: