Target
D(2) dopamine receptor
Ligand
BDBM50119383
Substrate
Meas. Tech.
ChEMBL_61809 (CHEMBL672573)
Ki
48±n/a nM
Citation
 Bettinetti, LSchlotter, KHübner, HGmeiner, P Interactive SAR studies: rational discovery of super-potent and highly selective dopamine D3 receptor antagonists and partial agonists. J Med Chem 45:4594-7 (2002)  
Target
Name:
D(2) dopamine receptor
Synonyms:
D(2) dopamine receptor DOPAMINE D2 Long DRD2 Dopamine D2 receptor Dopamine D2 receptor (D2R) Dopamine2-like | d2
Type:
Cell-surface receptors
Mol. Mass.:
50647.10
Organism:
Homo sapiens (Human)
Description:
P14416
Residue:
443
  
Inhibitor
Name:
BDBM50119383
Synonyms:
Benzo[b]tellurophene-2-carboxylic acid {4-[4-(2,3-dichloro-phenyl)-piperazin-1-yl]-butyl}-amide | CHEMBL337531
Type:
Small organic molecule
Emp. Form.:
C23H25Cl2N3OTe
Mol. Mass.:
558
SMILES:
Clc1cccc(N2CCN(CCCCNC(=O)C3=Cc4ccccc4[Te]3)CC2)c1Cl
: