Target
D(3) dopamine receptor
Ligand
BDBM50119383
Substrate
Meas. Tech.
ChEMBL_62129 (CHEMBL674519)
Ki
0.55±n/a nM
Citation
 Bettinetti, LSchlotter, KHübner, HGmeiner, P Interactive SAR studies: rational discovery of super-potent and highly selective dopamine D3 receptor antagonists and partial agonists. J Med Chem 45:4594-7 (2002)  
Target
Name:
D(3) dopamine receptor
Synonyms:
DOPAMINE D3 DRD3_HUMAN Dopamine D3 receptor (D3) Dopamine receptor Dopamine receptor D3
Type:
Mol. Mass.:
44243.43
Organism:
Homo sapiens (Human)
Description:
Residue:
400
  
Inhibitor
Name:
BDBM50119383
Synonyms:
Benzo[b]tellurophene-2-carboxylic acid {4-[4-(2,3-dichloro-phenyl)-piperazin-1-yl]-butyl}-amide | CHEMBL337531
Type:
Small organic molecule
Emp. Form.:
C23H25Cl2N3OTe
Mol. Mass.:
558
SMILES:
Clc1cccc(N2CCN(CCCCNC(=O)C3=Cc4ccccc4[Te]3)CC2)c1Cl
: