Target
5-hydroxytryptamine receptor 1A
Ligand
BDBM50119377
Substrate
Meas. Tech.
ChEMBL_1075 (CHEMBL616399)
Ki
17±n/a nM
Citation
 Bettinetti, LSchlotter, KHübner, HGmeiner, P Interactive SAR studies: rational discovery of super-potent and highly selective dopamine D3 receptor antagonists and partial agonists. J Med Chem 45:4594-7 (2002)  
Target
Name:
5-hydroxytryptamine receptor 1A
Synonyms:
5-HT-1A 5-hydroxytryptamine receptor 1A (5-HT-1A) ADRB2RL1 Dopamine D2 receptor and serotonin 1a receptor HTR1A | Serotonin receptor 1A
Type:
Mol. Mass.:
46122.49
Organism:
Homo sapiens (Human)
Description:
Residue:
422
  
Inhibitor
Name:
BDBM50119377
Synonyms:
Benzofuran-2-carboxylic acid {4-[4-(2-methoxy-phenyl)-piperazin-1-yl]-butyl}-amide N-(4-(4-(2-methoxyphenyl)piperazin-1-yl)butyl)benzofuran-2-carboxamide
Type:
Small organic molecule
Emp. Form.:
C24H29N3O3
Mol. Mass.:
407.5054
SMILES:
COc1ccccc1N1CCN(CCCCNC(=O)c2cc3ccccc3o2)CC1
: