Target
D(3) dopamine receptor
Ligand
BDBM50119378
Substrate
Meas. Tech.
ChEMBL_62129 (CHEMBL674519)
Ki
20±n/a nM
Citation
 Bettinetti, LSchlotter, KHübner, HGmeiner, P Interactive SAR studies: rational discovery of super-potent and highly selective dopamine D3 receptor antagonists and partial agonists. J Med Chem 45:4594-7 (2002)  
Target
Name:
D(3) dopamine receptor
Synonyms:
DOPAMINE D3 DRD3_HUMAN Dopamine D3 receptor (D3) Dopamine receptor Dopamine receptor D3
Type:
Mol. Mass.:
44243.43
Organism:
Homo sapiens (Human)
Description:
Residue:
400
  
Inhibitor
Name:
BDBM50119378
Synonyms:
CHEMBL143352 Pyrazolo[1,5-a]pyridine-4-carboxylic acid {4-[4-(2-methoxy-phenyl)-piperazin-1-yl]-butyl}-amide
Type:
Small organic molecule
Emp. Form.:
C23H29N5O2
Mol. Mass.:
407.5087
SMILES:
COc1ccccc1N1CCN(CCCCNC(=O)c2cccn3nccc23)CC1
: