Target
D(2) dopamine receptor
Ligand
BDBM50119384
Substrate
Meas. Tech.
ChEMBL_61809 (CHEMBL672573)
Ki
80±n/a nM
Citation
 Bettinetti, LSchlotter, KHübner, HGmeiner, P Interactive SAR studies: rational discovery of super-potent and highly selective dopamine D3 receptor antagonists and partial agonists. J Med Chem 45:4594-7 (2002)  
Target
Name:
D(2) dopamine receptor
Synonyms:
D(2) dopamine receptor DOPAMINE D2 Long DRD2 Dopamine D2 receptor Dopamine D2 receptor (D2R) Dopamine2-like | d2
Type:
Cell-surface receptors
Mol. Mass.:
50647.10
Organism:
Homo sapiens (Human)
Description:
P14416
Residue:
443
  
Inhibitor
Name:
BDBM50119384
Synonyms:
Benzofuran-2-carboxylic acid {4-[4-(2,3-dichloro-phenyl)-piperazin-1-yl]-butyl}-amide N-(4-(4-(2,3-dichlorophenyl)piperazin-1-yl)butyl)benzofuran-2-carboxamide
Type:
Small organic molecule
Emp. Form.:
C23H25Cl2N3O2
Mol. Mass.:
446.37
SMILES:
Clc1cccc(N2CCN(CCCCNC(=O)c3cc4ccccc4o3)CC2)c1Cl
: