Target
D(2) dopamine receptor
Ligand
BDBM50119381
Substrate
Meas. Tech.
ChEMBL_61482 (CHEMBL672384)
Ki
30±n/a nM
Citation
 Bettinetti, LSchlotter, KHübner, HGmeiner, P Interactive SAR studies: rational discovery of super-potent and highly selective dopamine D3 receptor antagonists and partial agonists. J Med Chem 45:4594-7 (2002)  
Target
Name:
D(2) dopamine receptor
Synonyms:
D(2) dopamine receptor DOPAMINE D2 Long DRD2 Dopamine D2 receptor Dopamine D2 receptor (D2R) Dopamine2-like | d2
Type:
Cell-surface receptors
Mol. Mass.:
50647.10
Organism:
Homo sapiens (Human)
Description:
P14416
Residue:
443
  
Inhibitor
Name:
BDBM50119381
Synonyms:
CHEMBL139600 Pyrazolo[1,5-a]pyridine-3-carboxylic acid {5-[4-(2-methoxy-phenyl)-piperazin-1-yl]-pentyl}-amide
Type:
Small organic molecule
Emp. Form.:
C24H31N5O2
Mol. Mass.:
421.5352
SMILES:
COc1ccccc1N1CCN(CCCCCNC(=O)c2cnn3ccccc23)CC1
: