Target
D(4) dopamine receptor
Ligand
BDBM50119385
Substrate
Meas. Tech.
ChEMBL_60668 (CHEMBL671704)
Ki
67±n/a nM
Citation
 Bettinetti, LSchlotter, KHübner, HGmeiner, P Interactive SAR studies: rational discovery of super-potent and highly selective dopamine D3 receptor antagonists and partial agonists. J Med Chem 45:4594-7 (2002)  
Target
Name:
D(4) dopamine receptor
Synonyms:
D(2C) dopamine receptor DOPAMINE D4.2 DRD4 Dopamine D4 receptor
Type:
Enzyme
Mol. Mass.:
48373.19
Organism:
Homo sapiens (Human)
Description:
P21917
Residue:
419
  
Inhibitor
Name:
BDBM50119385
Synonyms:
CHEMBL342060 Pyrazolo[1,5-a]pyridine-5-carboxylic acid {4-[4-(2-methoxy-phenyl)-piperazin-1-yl]-butyl}-amide
Type:
Small organic molecule
Emp. Form.:
C23H29N5O2
Mol. Mass.:
407.5087
SMILES:
COc1ccccc1N1CCN(CCCCNC(=O)c2ccn3nccc3c2)CC1
: