Target
fMet-Leu-Phe receptor
Ligand
BDBM50026943
Substrate
Meas. Tech.
ChEMBL_69352 (CHEMBL677588)
IC50
2200±n/a nM
Citation
 Loor, FTiberghien, FWenandy, TDidier, ATraber, R Cyclosporins: structure-activity relationships for the inhibition of the human FPR1 formylpeptide receptor. J Med Chem 45:4613-28 (2002)  
Target
Name:
fMet-Leu-Phe receptor
Synonyms:
FPR FPR1_HUMAN N-formyl peptide receptor 1 fMLP receptor formyl peptide receptor 1
Type:
Enzyme Catalytic Domain
Mol. Mass.:
38456.14
Organism:
Homo sapiens (Human)
Description:
gi_4503779
Residue:
350
  
Inhibitor
Name:
BDBM50026943
Synonyms:
CHEMBL2372474
Type:
Small organic molecule
Emp. Form.:
C60H107N11O12
Mol. Mass.:
1174.5581
SMILES:
[H][C@@]1([C@H](O)[C@H](C)C\C=C\C)N(C)C(=O)[C@H](C(C)C)N(C)C(=O)[C@H](CC(C)C)NC(=O)[C@H](CC(C)C)N(C)C(=O)[C@@H](C)NC(=O)[C@H](C)NC(=O)[C@@H](CC(C)C)N(C)C(=O)[C@H](NC(=O)[C@@H](CC(C)C)N(C)C(=O)CN(C)C(=O)[C@H](C)NC1=O)C(C)C
: