Target
Adenosine receptor A1
Ligand
BDBM50003018
Substrate
Meas. Tech.
ChEMBL_29113 (CHEMBL638725)
Ki
15±n/a nM
Citation
 Bondavalli, FBotta, MBruno, OCiacci, ACorelli, FFossa, PLucacchini, AManetti, FMartini, CMenozzi, GMosti, LRanise, ASchenone, STafi, ATrincavellic, ML Synthesis, molecular modeling studies, and pharmacological activity of selective A(1) receptor antagonists. J Med Chem 45:4875-87 (2002)  
Target
Name:
Adenosine receptor A1
Synonyms:
AA1R_BOVIN ADENOSINE A1 high ADORA1 | Adenosine A1 receptor
Type:
Enzyme Catalytic Domain
Mol. Mass.:
36602.99
Organism:
BOVINE
Description:
ADENOSINE 0 BOVINE::P28190
Residue:
326
  
Inhibitor
Name:
BDBM50003018
Synonyms:
8-(3-Oxo-cyclopentyl)-1,3-dipropyl-3,7-dihydro-purine-2,6-dione | CHEMBL84545
Type:
Small organic molecule
Emp. Form.:
C16H22N4O3
Mol. Mass.:
318.3709
SMILES:
CCCn1c2nc([nH]c2c(=O)n(CCC)c1=O)C1CCC(=O)C1
: