Target
Delta-type opioid receptor
Ligand
BDBM50272169
Substrate
Meas. Tech.
ChEMBL_122682 (CHEMBL733564)
IC50
0.12±n/a nM
Citation
 Balboni, GSalvadori, SGuerrini, RNegri, LGiannini, EJinsmaa, YBryant, SDLazarus, LH Potent delta-opioid receptor agonists containing the Dmt-Tic pharmacophore. J Med Chem 45:5556-63 (2002)  
Target
Name:
Delta-type opioid receptor
Synonyms:
DOR-1 MSL-2 OPRD_MOUSE Oprd1
Type:
Enzyme Catalytic Domain
Mol. Mass.:
40577.25
Organism:
MOUSE
Description:
P32300
Residue:
372
  
Inhibitor
Name:
BDBM50272169
Synonyms:
(S)-3-((S)-2-((S)-2-amino-3-(4-hydroxy-2,6-dimethylphenyl)propanoyl)-1,2,3,4-tetrahydroisoquinoline-3-carboxamido)-3-(1H-benzo[d]imidazol-2-yl)propanoic acid CHEMBL442577 UFP-512
Type:
Small organic molecule
Emp. Form.:
C31H33N5O5
Mol. Mass.:
555.6242
SMILES:
Cc1cc(O)cc(C)c1C[C@H](N)C(=O)N1Cc2ccccc2C[C@H]1C(=O)N[C@@H](CC(O)=O)c1nc2ccccc2[nH]1
: