Target
Matrix metalloproteinase-9
Ligand
BDBM50109616
Substrate
Meas. Tech.
ChEMBL_105387 (CHEMBL710806)
Ki
7±n/a nM
Citation
 Sawa, MKiyoi, TKurokawa, KKumihara, HYamamoto, MMiyasaka, TIto, YHirayama, RInoue, TKirii, YNishiwaki, EOhmoto, HMaeda, YIshibushi, EInoue, YYoshino, KKondo, H New type of metalloproteinase inhibitor: design and synthesis of new phosphonamide-based hydroxamic acids. J Med Chem 45:919-29 (2002)  
Target
Name:
Matrix metalloproteinase-9
Synonyms:
67 kDa matrix metalloproteinase-9 92 kDa gelatinase CLG4B Gelatinase B MMP9 Matrix metalloproteinase 9 (MMP-9) Matrix metalloproteinase-9 (MMP9)
Type:
Enzyme
Mol. Mass.:
78452.28
Organism:
Homo sapiens (Human)
Description:
P14780
Residue:
707
  
Inhibitor
Name:
BDBM50109616
Synonyms:
(7-Hydroxycarbamoyl-7,8-dihydro-5H-pyrido[3,4-b]pyrazin-6-yl)-(4-methoxy-phenyl)-phosphinic acid ethyl ester | CHEMBL177072
Type:
Small organic molecule
Emp. Form.:
C17H21N4O5P
Mol. Mass.:
392.3462
SMILES:
CCOP(=O)(N1Cc2nccnc2CC1C(=O)NO)c1ccc(OC)cc1
: