Target
Interstitial collagenase
Ligand
BDBM50109614
Substrate
Meas. Tech.
ChEMBL_106139 (CHEMBL718686)
Ki
>850±n/a nM
Citation
 Sawa, MKiyoi, TKurokawa, KKumihara, HYamamoto, MMiyasaka, TIto, YHirayama, RInoue, TKirii, YNishiwaki, EOhmoto, HMaeda, YIshibushi, EInoue, YYoshino, KKondo, H New type of metalloproteinase inhibitor: design and synthesis of new phosphonamide-based hydroxamic acids. J Med Chem 45:919-29 (2002)  
Target
Name:
Interstitial collagenase
Synonyms:
CLG MMP1 Matrix metalloproteinase-1 | Matrix metalloproteinase-1 (MMP-1)
Type:
Enzyme
Mol. Mass.:
54010.26
Organism:
Homo sapiens (Human)
Description:
P03956
Residue:
469
  
Inhibitor
Name:
BDBM50109614
Synonyms:
CHEMBL353536 | [4-(2-Ethoxy-ethoxy)-phenyl]-(3-hydroxycarbamoyl-3,4-dihydro-1H-isoquinolin-2-yl)-phosphinic acid ethyl ester
Type:
Small organic molecule
Emp. Form.:
C22H29N2O6P
Mol. Mass.:
448.4492
SMILES:
CCOCCOc1ccc(cc1)P(=O)(OCC)N1Cc2ccccc2CC1C(=O)NO
: