Target
Cholinesterase
Ligand
BDBM8971
Substrate
Meas. Tech.
ChEMBL_41269 (CHEMBL655026)
Ki
0.4±n/a nM
Citation
 Savini, LGaeta, AFattorusso, CCatalanotti, BCampiani, GChiasserini, LPellerano, CNovellino, EMcKissic, DSaxena, A Specific targeting of acetylcholinesterase and butyrylcholinesterase recognition sites. Rational design of novel, selective, and highly potent cholinesterase inhibitors. J Med Chem 46:1-4 (2002)  
Target
Name:
Cholinesterase
Synonyms:
Acylcholine acylhydrolase Butyrylcholine esterase (BChE) Butyrylcholinesterase (BuChE) CHLE_HUMAN Cholinesterases Pseudocholinesterase
Type:
Homotetramer
Mol. Mass.:
68422.27
Organism:
Homo sapiens (Human)
Description:
P06276
Residue:
602
  
Inhibitor
Name:
BDBM8971
Synonyms:
CHEMBL129108 Tacrine Dimer 4g
Type:
Small organic molecule
Emp. Form.:
C34H41N3S
Mol. Mass.:
523.774
SMILES:
C(CCCCSc1c2CCCCc2nc2ccccc12)CCCNc1c2CCCCc2nc2ccccc12
: