Target
Reverse transcriptase/RNaseH
Ligand
BDBM50127511
Substrate
Meas. Tech.
ChEMBL_195507 (CHEMBL798928)
IC50
22.3±n/a nM
Citation
 Hyde, RMBroom, ADBuckheit, RW Antiviral amphipathic oligo- and polyribonucleotides: analogue development and biological studies. J Med Chem 46:1878-85 (2003)  
Target
Name:
Reverse transcriptase/RNaseH
Synonyms:
HIV-1 Reverse Transcriptase RNase H Reverse transcriptase/RNaseH
Type:
PROTEIN
Mol. Mass.:
65229.15
Organism:
Human immunodeficiency virus 1
Description:
ChEMBL_1473730
Residue:
566
  
Inhibitor
Name:
BDBM50127511
Synonyms:
4-hydroxy-2-(methoxymethyl)-5-(6-oxo-1-prop-2-ynyl-1,6-dihydro-9H-purin-9-yl)tetrahydrofuran-3-yl methylphosphonate
Type:
Small organic molecule
Emp. Form.:
C15H18N4O7P
Mol. Mass.:
397.3003
SMILES:
COC[C@H]1O[C@H](C(O)[C@H]1OP(C)([O-])=O)n1cnc2c1ncn(CC#C)c2=O
: