Target
Reverse transcriptase/RNaseH
Ligand
BDBM50127517
Substrate
Meas. Tech.
ChEMBL_195507 (CHEMBL798928)
IC50
39±n/a nM
Citation
 Hyde, RMBroom, ADBuckheit, RW Antiviral amphipathic oligo- and polyribonucleotides: analogue development and biological studies. J Med Chem 46:1878-85 (2003)  
Target
Name:
Reverse transcriptase/RNaseH
Synonyms:
HIV-1 Reverse Transcriptase RNase H Reverse transcriptase/RNaseH
Type:
PROTEIN
Mol. Mass.:
65229.15
Organism:
Human immunodeficiency virus 1
Description:
ChEMBL_1473730
Residue:
566
  
Inhibitor
Name:
BDBM50127517
Synonyms:
O-[5-(1-allyl-6-oxo-1,6-dihydro-9H-purin-9-yl)-4-methoxy-2-(methoxymethyl)tetrahydrofuran-3-yl] methylphosphonothioate
Type:
Small organic molecule
Emp. Form.:
C16H22N4O6PS
Mol. Mass.:
429.408
SMILES:
COC[C@H]1O[C@H](C(OC)[C@H]1OP(C)([O-])=S)n1cnc2c1ncn(CC=C)c2=O
: