Target
Cytochrome P450 3A4
Ligand
BDBM50370258
Substrate
Meas. Tech.
ChEMBL_51927 (CHEMBL663575)
IC50
20000±n/a nM
Citation
 Wu, YJDavis, CDDworetzky, SFitzpatrick, WCHarden, DHe, HKnox, RJNewton, AEPhilip, TPolson, CSivarao, DVSun, LQTertyshnikova, SWeaver, DYeola, SZoeckler, MSinz, MW Fluorine substitution can block CYP3A4 metabolism-dependent inhibition: identification of (S)-N-[1-(4-fluoro-3- morpholin-4-ylphenyl)ethyl]-3- (4-fluorophenyl)acrylamide as an orally bioavailable KCNQ2 opener devoid of CYP3A4 metabolism-dependent inhibition. J Med Chem 46:3778-81 (2003)  
Target
Name:
Cytochrome P450 3A4
Synonyms:
Albendazole monooxygenase CP3A4_HUMAN CYP3A4 CYPIIIA4 Cytochrome P450 3A4 (CYP3A4) Nifedipine oxidase Taurochenodeoxycholate 6-alpha-hydroxylase
Type:
Enzyme
Mol. Mass.:
57349.57
Organism:
Homo sapiens (Human)
Description:
Residue:
503
  
Inhibitor
Name:
BDBM50370258
Synonyms:
TROLEANDOMYCIN | Triacetyloleandomycin
Type:
Small organic molecule
Emp. Form.:
C41H67NO15
Mol. Mass.:
813.9684
SMILES:
CO[C@H]1C[C@H](O[C@H]2[C@H](C)[C@@H](O[C@@H]3O[C@H](C)C[C@@H]([C@H]3OC(C)=O)N(C)C)[C@@H](C)C[C@@]3(CO3)C(=O)[C@H](C)[C@@H](OC(C)=O)[C@@H](C)[C@@H](C)OC(=O)[C@@H]2C)O[C@@H](C)[C@@H]1OC(C)=O
: