Target
Calcium/calmodulin-dependent protein kinase type II subunit alpha/beta/delta/gamma
Ligand
BDBM50133064
Substrate
Meas. Tech.
ChEMBL_43095 (CHEMBL658419)
IC50
>10000±n/a nM
Citation
 Kuo, GHProuty, CDeAngelis, AShen, LO'Neill, DJShah, CConnolly, PJMurray, WVConway, BRCheung, PWestover, LXu, JZLook, RADemarest, KTEmanuel, SMiddleton, SAJolliffe, LBeavers, MPChen, X Synthesis and discovery of macrocyclic polyoxygenated bis-7-azaindolylmaleimides as a novel series of potent and highly selective glycogen synthase kinase-3beta inhibitors. J Med Chem 46:4021-31 (2003)  
Target
Name:
Calcium/calmodulin-dependent protein kinase type II subunit alpha/beta/delta/gamma
Synonyms:
CaM kinase II
Type:
Mol. Mass.:
Description:
ASSAY_ID of ChEMBL is 368599
Components:
This complex has 4 components.
Component 1
Name:
Calcium/calmodulin-dependent protein kinase type II subunit alpha
Synonyms:
CAMK2A CaM kinase II Calcium/calmodulin-dependent protein kinase type II subunit alpha (CAMK2a) KIAA0968
Type:
Enzyme Catalytic Domain
Mol. Mass.:
54093.63
Organism:
Homo sapiens (Human)
Description:
gi_25952118
Residue:
478
  
Component 2
Name:
Calcium/calmodulin-dependent protein kinase type II subunit gamma
Synonyms:
2.7.11.17 CAMK-II CAMKG CaM kinase II gamma CaMK-II subunit gamma Calcium/calmodulin-dependent protein kinase type II subunit gamma (CAMKllg) | KCC2G_HUMAN
Type:
Protein
Mol. Mass.:
62621.56
Organism:
Homo sapiens (Human)
Description:
Q13555
Residue:
558
  
Component 3
Name:
Calcium/calmodulin-dependent protein kinase type II subunit beta
Synonyms:
CAM2 CAMK2B CaM kinase II CaM kinase II subunit beta CaMK-II subunit beta Calcium/calmodulin-dependent protein kinase type II beta chain | KCC2B_HUMAN
Type:
Enzyme Catalytic Domain
Mol. Mass.:
72685.48
Organism:
Homo sapiens (Human)
Description:
gi_26051204
Residue:
666
  
Component 4
Name:
Calcium/calmodulin-dependent protein kinase type II subunit delta
Synonyms:
CAMK2D CaM kinase II CaMK-II subunit delta Calcium/calmodulin-dependent protein kinase type II subunit delta (CAMK2D) KCC2D_HUMAN
Type:
Enzyme Catalytic Domain
Mol. Mass.:
56419.78
Organism:
Homo sapiens (Human)
Description:
Q13557
Residue:
499
  
Inhibitor
Name:
BDBM50133064
Synonyms:
17,20,23-trioxa-4,12,14,26,28-pentaazahexacyclo[24.6.1.17,14.02,6.08,13.027,32]tetratriaconta-1(33),2(6),7(34),8,10,12,27,29,31-nonaene-3,5-dione | CHEMBL340776
Type:
Small organic molecule
Emp. Form.:
C26H25N5O5
Mol. Mass.:
487.5072
SMILES:
O=C1NC(=O)C2=C1c1cn(CCOCCOCCOCCn3cc2c2cccnc32)c2ncccc12
: