Target
Protein kinase C alpha type
Ligand
BDBM50133057
Substrate
Meas. Tech.
ChEMBL_160106 (CHEMBL767708)
IC50
86±n/a nM
Citation
 Kuo, GHProuty, CDeAngelis, AShen, LO'Neill, DJShah, CConnolly, PJMurray, WVConway, BRCheung, PWestover, LXu, JZLook, RADemarest, KTEmanuel, SMiddleton, SAJolliffe, LBeavers, MPChen, X Synthesis and discovery of macrocyclic polyoxygenated bis-7-azaindolylmaleimides as a novel series of potent and highly selective glycogen synthase kinase-3beta inhibitors. J Med Chem 46:4021-31 (2003)  
Target
Name:
Protein kinase C alpha type
Synonyms:
KPCA_HUMAN PKC alpha and beta-2 PKC-alpha PRKACA Protein Kinase C- alpha Protein kinase C alpha (PKCa) Protein kinase C alpha type (PRKCA) RAF proto-oncogene serine/threonine-protein kinase
Type:
Enzyme
Mol. Mass.:
76755.65
Organism:
Homo sapiens (Human)
Description:
The recombinant human PKC enzymes were produced using a baculovirus expression system in SF9 cells
Residue:
672
  
Inhibitor
Name:
BDBM50133057
Synonyms:
17,20,23-trioxa-4,14,26-triazahexacyclo[24.6.1.17,14.02,6.08,13.027,32]tetratriaconta-1(33),2(6),7(34),8,10,12,27,29,31-nonaene-3,5-dione Indolylylmaleimide 2
Type:
Small organic molecule
Emp. Form.:
C28H27N3O5
Mol. Mass.:
485.5311
SMILES:
O=C1NC(=O)C2=C1c1cn(CCOCCOCCOCCn3cc2c2ccccc32)c2ccccc12
: