Target
Cyclin-dependent kinase 2
Ligand
BDBM50133058
Substrate
Meas. Tech.
ChEMBL_50671 (CHEMBL662526)
IC50
>10000±n/a nM
Citation
 Kuo, GHProuty, CDeAngelis, AShen, LO'Neill, DJShah, CConnolly, PJMurray, WVConway, BRCheung, PWestover, LXu, JZLook, RADemarest, KTEmanuel, SMiddleton, SAJolliffe, LBeavers, MPChen, X Synthesis and discovery of macrocyclic polyoxygenated bis-7-azaindolylmaleimides as a novel series of potent and highly selective glycogen synthase kinase-3beta inhibitors. J Med Chem 46:4021-31 (2003)  
Target
Name:
Cyclin-dependent kinase 2
Synonyms:
CDK2 CDK2_HUMAN Cell division protein kinase 2 Protein cereblon/Cyclin-dependent kinase 2 | p33 protein kinase
Type:
Enzyme Subunit
Mol. Mass.:
33938.17
Organism:
Homo sapiens (Human)
Description:
P24941
Residue:
298
  
Inhibitor
Name:
BDBM50133058
Synonyms:
17,20,23,26-tetraoxa-4,12,14,29,31-pentaazahexacyclo[27.6.1.17,14.02,6.08,13.030,35]heptatriaconta-1(36),2(6),7(37),8,10,12,30,32,34-nonaene-3,5-dione | CHEMBL337642
Type:
Small organic molecule
Emp. Form.:
C28H29N5O6
Mol. Mass.:
531.5598
SMILES:
O=C1NC(=O)C2=C1c1cn(CCOCCOCCOCCOCCn3cc2c2cccnc32)c2ncccc12
: